BDBM264808 US9718790, I-1585
SMILES CC(C)c1nc2ccc(cc2s1)\N=c1/[nH]c(=O)n([C@@H](C)[C@@H](C)C(O)=O)c(=O)n1Cc1ccc(Cl)cc1
InChI Key
Data  1 IC50
  Tab Delimited (TSV)   2D SDfile   Computed 3D by Vconf -m prep SDfile
Find this compound or compounds like it in BindingDB:
Activity Spreadsheet -- Enzyme Inhibition Constant Data from BindingDB
Found 1 hit for monomerid = 264808
TargetP2X purinoceptor 3(Homo sapiens (Human))
Shionogi
US Patent
LigandPNGBDBM264808(US9718790, I-1585)
Affinity DataIC50:  14nMpH: 7.5Assay Description:Stably expressing cell line (C6BU-1 transfected with human P2X3 receptor gene (GenBank accession number Y07683) was used. The cells were seeded in a ...
Ligand InfoPC cidPC sid
In DepthDetails US Patent